﻿"Item Id","Item URI","Dublin Core:Title","Dublin Core:Subject","Dublin Core:Description","Dublin Core:Creator","Dublin Core:Source","Dublin Core:Publisher","Dublin Core:Date","Dublin Core:Contributor","Dublin Core:Rights","Dublin Core:Relation","Dublin Core:Format","Dublin Core:Language","Dublin Core:Type","Dublin Core:Identifier","Dublin Core:Coverage","Item Type Metadata:Text","Item Type Metadata:Interviewer","Item Type Metadata:Interviewee","Item Type Metadata:Location","Item Type Metadata:Transcription","Item Type Metadata:Local URL","Item Type Metadata:Original Format","Item Type Metadata:Physical Dimensions","Item Type Metadata:Duration","Item Type Metadata:Compression","Item Type Metadata:Producer","Item Type Metadata:Director","Item Type Metadata:Bit Rate/Frequency","Item Type Metadata:Time Summary","Item Type Metadata:Email Body","Item Type Metadata:Subject Line","Item Type Metadata:From","Item Type Metadata:To","Item Type Metadata:CC","Item Type Metadata:BCC","Item Type Metadata:Number of Attachments","Item Type Metadata:Standards","Item Type Metadata:Objectives","Item Type Metadata:Materials","Item Type Metadata:Lesson Plan Text","Item Type Metadata:URL","Item Type Metadata:Event Type","Item Type Metadata:Participants","Item Type Metadata:Birth Date","Item Type Metadata:Birthplace","Item Type Metadata:Death Date","Item Type Metadata:Occupation","Item Type Metadata:Biographical Text","Item Type Metadata:Bibliography","Item Type Metadata:Box","Item Type Metadata:Folder","Item Type Metadata:Series","Item Type Metadata:Screwworm Topical Chapter","Item Type Metadata:Screwworm Chrono Chapter","Item Type Metadata:Sub-collection","Item Type Metadata:Name","Item Type Metadata:Institution/Organization","PDF Text:Text",tags,file,itemType,collection,public,featured
1392,https://www.nal.usda.gov/exhibits/speccoll/items/show/1392,"Military Specification: Ferric Chloride, Anhydrous, Crystalline, Technical, MIL-F-14580A","chemical properties","<strong>Corporate Author: </strong>Department of Defense",,,,"May 11 1965",,,,,,,,,,,,,,,,,,,,,,,,,,,,,,,,,,,,,,,,,,,020,0284,"Series II",,,,,,,,https://www.nal.usda.gov/exhibits/speccoll/files/original/807baa2faf1a28d2ce4095abd8ff46e9.pdf,Text,"Alvin L. Young Collection on Agent Orange",1,0
1391,https://www.nal.usda.gov/exhibits/speccoll/items/show/1391,"Graph: Viscosity in Centipoises - Relative to Water at 68 degree; with cover letter from W.C. Jackson to Raymond Hammon, November 30, 1964","chemical properties","<strong>Corporate Author: </strong>Pennsalt Chemicals Corporation, Pittsburgh, Pennsylvania",,,,,,,,,,,,,,,,,,,,,,,,,,,,,,,,,,,,,,,,,,,,,,,020,0283,"Series II",,,,,,,,,Text,"Alvin L. Young Collection on Agent Orange",1,0
2286,https://www.nal.usda.gov/exhibits/speccoll/items/show/2286,"Binding of DDT to Lecithin","chemical properties^^pesticide properties",,"Tinsley, I. J.^^R. Haque^^D. Schmedding",Science,,"October 8 1971",,,,,,,,,,,,,,,,,,,,,,,,,,,,,,,,,,,,,,,,,,,048,1233,"Series III Subseries I",,,,,,,ao_seriesIII,,Text,"Alvin L. Young Collection on Agent Orange",1,0
2025,https://www.nal.usda.gov/exhibits/speccoll/items/show/2025,"2,3,7,8-Tetrachlorodibenzo-p-dioxin and Related Halogenated Aromatic Hydrocarbons: Examination of the Mechanism of Toxicity","chloracne^^health effects^^chemical properties",,"Poland, Alan^^Joyce C. Knutson","Annual Review of Pharmacology and Toxicology",,1982,,,,,,,,,,,,,,,,,,,,,,,,,,,,,,,,,,,,,,,,,,,041,0972,"Series III Subseries I",,,,,,,ao_seriesIII,,Text,"Alvin L. Young Collection on Agent Orange",1,0
2006,https://www.nal.usda.gov/exhibits/speccoll/items/show/2006,"Chronic Poisoning by 2,3,7,8-Tetrachlorodibenzo-p-Dioxin","industrial exposure^^health effects^^chemical properties",,"Pazderova-Vejlupkova, J.^^E. Lukas^^M. Nemcova^^J. Pickova^^L. Jirasek","Pracovni Lekarstvi (Occupational Medicine)",,1980,,,,,,,,,,,,,,,,,,,,,,,,,,,,,,,,,,,,,,,,,,,041,0953,"Series III Subseries I",,,,,,,ao_seriesIII,,Text,"Alvin L. Young Collection on Agent Orange",1,0
1993,https://www.nal.usda.gov/exhibits/speccoll/items/show/1993,"Enzymatic Digestion of Liver Tissue to Release Barbiturates, Salicylic Acid and Other Acidic Compounds in Cases of Human Poisoning","herbicide poisoning^^chemical properties^^human",,"Osselton, M. D.^^I. C. Shaw^^H. M. Stevens",Analyst,,1978-11-01,,,,,,,,,,,,,,,,,,,,,,,,,,,,,,,,,,,,,,,,,,,041,0940,"Series III Subseries I",,,,,,,ao_seriesIII,,Text,"Alvin L. Young Collection on Agent Orange",1,0
1983,https://www.nal.usda.gov/exhibits/speccoll/items/show/1983,"Impurities in Commercial Products Related to Pentachlorophenol","herbicide properties^^chemical properties","<strong>Corporate Author: </strong>U.S. Environmental Protection Agency (EPA) University of West Florida","Nilsson, Carl-Axel^^Ake Norstrom^^Kurt Andersson^^Christopher Rappe","Pentachlorophenol : Chemistry, Pharmacology, and Environmental Toxicology",,1978,,,,,,,,,,,,,,,,,,,,,,,,,,,,,,,,,,,,,,,,,,,040,0930,"Series III Subseries I",,,,,,,ao_seriesIII,,Text,"Alvin L. Young Collection on Agent Orange",1,0
2324,https://www.nal.usda.gov/exhibits/speccoll/items/show/2324,"A Benchmark Approach to Interpretation of Environmental Data Using Nitrapyrin as an Example","chemical properties^^ecological fate","<strong>Corporate Author: </strong>Residue/Environmental/Metabolism Research, Agricultural Products Department, Dow Chemical, USA, Midland, Michigan","Laskowski, D. A.",,,"November 30 1976",,,,,,,,,,,,,,,,,,,,,,,,,,,,,,,,,,,,,,,,,,,049,1272,"Series III Subseries II",,,,,,,ao_seriesIII,,Text,"Alvin L. Young Collection on Agent Orange",1,0
2350,https://www.nal.usda.gov/exhibits/speccoll/items/show/2350,"Chapter Two: Classes of Toxic Compounds: Procedures and Principles for Evaluating Toxicity","herbicide toxicity^^chemical properties^^human exposure",,"Hite, Mark","Laboratory Safety: Theory and Practice",,1980,,,,,,,,,,,,,,,,,,,,,,,,,,,,,,,,,,,,,,,,,,,050,1307,"Series III Subseries II",,,,,,,ao_seriesIII,,Text,"Alvin L. Young Collection on Agent Orange",1,0
1805,https://www.nal.usda.gov/exhibits/speccoll/items/show/1805,"Program for Monitoring Potential Contamination in the Laboratory following the Handling and Analyses of Chlorinated Dibenzo - p - dioxins and Dibenzofurans","chemical properties^^dioxin^^safety",,"Hileman, F. D.^^T. Mazer^^D.E. Kirk","Human and Environmental Risk of Chlorinated Dioxins and Related Compounds",,1983,,,,,,,,,,,,,,,,,,,,,,,,,,,,,,,,,,,,,,,,,,,035,0752,"Series III Subseries I",,,,,,,ao_seriesIII,,Text,"Alvin L. Young Collection on Agent Orange",1,0
1804,https://www.nal.usda.gov/exhibits/speccoll/items/show/1804,"The Possible Formation of Tetrachlorodibenzo - p - dioxines in the Production of Chloranil","TCDD^^animal testing^^chemical properties^^herbicide toxicology",,"Hess, P.^^J. Asshauer^^H. Hollander","Ecotoxicology and Environmental Safety",,1982,,,,,,,,,,,,,,,,,,,,,,,,,,,,,,,,,,,,,,,,,,,035,0751,"Series III Subseries I",,,,,,,ao_seriesIII,,Text,"Alvin L. Young Collection on Agent Orange",1,0
1794,https://www.nal.usda.gov/exhibits/speccoll/items/show/1794,"Seveso: The Aftermath","Italy^^decontamination^^chemical properties",,"Hay, Alastair",Nature,,"October 14 1976",,,,,,,,,,,,,,,,,,,,,,,,,,,,,,,,,,,,,,,,,,,035,0741,"Series III Subseries I",,,,,,,ao_seriesIII,,Text,"Alvin L. Young Collection on Agent Orange",1,0
2313,https://www.nal.usda.gov/exhibits/speccoll/items/show/2313,"Chemical Pollution: Polychlorinated Biphenyls","PCBs^^chemical properties^^DDT",,"Hammond, Allen L.",Science,,"January 14 1972",,,,,,,,,,,,,,,,,,,,,,,,,,,,,,,,,,,,,,,,,,,049,1260,"Series III Subseries II",,,,,,,ao_seriesIII,,Text,"Alvin L. Young Collection on Agent Orange",1,0
3208,https://www.nal.usda.gov/exhibits/speccoll/items/show/3208,"Typescript: Progress Report: Evaluation of In Vitro Assays for the Detection of ""Dioxin-Like"" Activity in the Binghamton State Office Building, May, 1983","BSOB^^chemical properties^^data analysis","<strong>Corporate Author: </strong>New York State Department of Health, Center for Laboratories and Research","Gierthy, John F.^^Gerald D. Frenkel",,,"May 23 1983",,,,,,,,,,,,,,,,,,,,,,,,,,,,,,,,,,,,,,,,,,,088,2233,"Series IV Subseries II",,,,,,,,https://www.nal.usda.gov/exhibits/speccoll/files/original/a805432627673c28e070d4ebbb50e78d.pdf,Text,"Alvin L. Young Collection on Agent Orange",1,0
1713,https://www.nal.usda.gov/exhibits/speccoll/items/show/1713,"Criteria for Assessing the Environmental Behavior of Chemicals: Selection and Preliminary Quantification","chemical properties",,"Frische, R.^^G. Esser^^W. Schonborn^^W. Klopffer","Ecotoxicology and Environmental Safety",,1982,,,,,,,,,,,,,,,,,,,,,,,,,,,,,,,,,,,,,,,,,,,033,0660,"Series III Subseries I",,,,,,,ao_seriesIII,,Text,"Alvin L. Young Collection on Agent Orange",1,0
